Temperature/Humidity Sensors
type: Concept

HUMIDITY SENSORS
type: Concept
change note: 2021-08-05 12:16:33.0 [sritz] insert AltLabel (id: null category: primary text: HUMIDITY SENSORS language code: en);
in scheme: instruments
definition: HUMIDITY SENSORS are devices that receive a signal or stimulus (as heat or pressure or light or motion etc.) and responds to it, in this case humidity or some measure of the water vapor content of air. Group: Instrument_Details Entry_ID: HUMIDITY SENSORS Group: Instrument_Identification Instrument_Category: In Situ/Laboratory Instruments Instrument_Class: Temperature/Humidity Sensors Short_Name: HUMIDITY SENSORS End_Group Group: Associated_Platforms Short_Name: SGO End_Group Creation_Date: 2007-07-10 End_Group