OCO-2
type: Concept
change note: 2020-06-22 13:21:09.0 [mmorahan] update Definition (OCO-2 will not be measuring CO2 directly; but actually, the intensity of the sunlight reflected from the presence of CO2 in a column of air. This measurement is unique like a fingerprint, and can be used for identification. The OCO-2 instrument will use a diffraction grating (like the back of a compact disk) to separate the incoming sunlight into a spectrum of multiple component colors. The instrument measures the intensity of three relatively small wavelength bands (Weak CO2, Strong CO2 and Oxygen O2) from the spectrum, each specific to one of the three spectrometers. The absorption levels will indicate the presence of the different gases. By simultaneously measuring the gases over the same location and over time, OCO-2 will be able to track the changes over the surface over time. The OCO-2 spectrometers will measure sunlight reflected off the Earth's surface. The sunlight rays entering the spectrometers will pass through the atmosphere twice - once as they travel from the Sun to the Earth, and then again as they bounce off from the Earth's surface to the OCO-2 instrument. Carbon dioxide and molecular oxygen molecules in the atmosphere absorb light energy at very specific colors or wavelengths. The OCO-2 instrument uses diffraction grating to separate the inbound light energy into a spectrum of multiple component colors. The reflection gratings used in the OCO-2 spectrometers will consist of a very regularly-spaced series of grooves that lie on a very flat surface. The characteristic spectral pattern for CO2 can alternate from transparent to opaque over very small variations in wavelength. The OCO-2 instrument must be able to detect these dramatic changes, and specify the wavelengths where these variations take place. So, the grooves in the instrument diffraction grating will be very finely tuned to spread the light spectrum into a large number of very narrow wavelength bands or colors. In fact, the OCO-2 instrume…
change note: 2020-06-22 10:29:23.0 [mmorahan] insert Definition (id: null text: language code: en);
change note: 2021-10-26 13:38:09.0 [sritz] update Definition (https://ocov2.jpl.nasa.gov/observatory/instrument/);
change note: 2020-06-22 07:46:25.0 [mmorahan] Insert Concept add broader relation (OCO-2 [b2fbdd42-4bd8-4462-8a00-1e81e1281fa8,560392] - Spectrometers [055a79c7-61db-4250-abad-f1e09909f14c,543071]);
change note: 2020-06-22 10:30:42.0 [mmorahan] update Definition (OCO-2 will not be measuring CO2 directly; but actually, the intensity of the sunlight reflected from the presence of CO2 in a column of air. This measurement is unique like a fingerprint, and can be used for identification. The OCO-2 instrument will use a diffraction grating (like the back of a compact disk) to separate the incoming sunlight into a spectrum of multiple component colors. The instrument measures the intensity of three relatively small wavelength bands (Weak CO2, Strong CO2 and Oxygen O2) from the spectrum, each specific to one of the three spectrometers. The absorption levels will indicate the presence of the different gases. By simultaneously measuring the gases over the same location and over time, OCO-2 will be able to track the changes over the surface over time. The OCO-2 spectrometers will measure sunlight reflected off the Earth's surface. The sunlight rays entering the spectrometers will pass through the atmosphere twice - once as they travel from the Sun to the Earth, and then again as they bounce off from the Earth's surface to the OCO-2 instrument. Carbon dioxide and molecular oxygen molecules in the atmosphere absorb light energy at very specific colors or wavelengths. The OCO-2 instrument uses diffraction grating to separate the inbound light energy into a spectrum of multiple component colors. The reflection gratings used in the OCO-2 spectrometers will consist of a very regularly-spaced series of grooves that lie on a very flat surface.);
change note: 2020-06-22 13:23:15.0 [mmorahan] update Definition (OCO-2 will not be measuring CO2 directly; but actually, the intensity of the sunlight reflected from the presence of CO2 in a column of air. This measurement is unique like a fingerprint, and can be used for identification. The OCO-2 instrument will use a diffraction grating (like the back of a compact disk) to separate the incoming sunlight into a spectrum of multiple component colors. The instrument measures the intensity of three relatively small wavelength bands (Weak CO2, Strong CO2 and Oxygen O2) from the spectrum, each specific to one of the three spectrometers. The absorption levels will indicate the presence of the different gases. By simultaneously measuring the gases over the same location and over time, OCO-2 will be able to track the changes over the surface over time. The OCO-2 spectrometers will measure sunlight reflected off the Earth's surface. The sunlight rays entering the spectrometers will pass through the atmosphere twice - once as they travel from the Sun to the Earth, and then again as they bounce off from the Earth's surface to the OCO-2 instrument. Carbon dioxide and molecular oxygen molecules in the atmosphere absorb light energy at very specific colors or wavelengths. The OCO-2 instrument uses diffraction grating to separate the inbound light energy into a spectrum of multiple component colors. The reflection gratings used in the OCO-2 spectrometers will consist of a very regularly-spaced series of grooves that lie on a very flat surface. The characteristic spectral pattern for CO2 can alternate from transparent to opaque over very small variations in wavelength. The OCO-2 instrument must be able to detect these dramatic changes, and specify the wavelengths where these variations take place. So, the grooves in the instrument diffraction grating will be very finely tuned to spread the light spectrum into a large number of very narrow wavelength bands or colors. In fact, the OCO-2 instrume…
change note: 2020-06-22 07:50:32.0 [mmorahan] insert AltLabel (id: null category: primary text: Orbiting Carbon Observatory - 2 language code: en);
change note: 2020-06-22 10:31:44.0 [mmorahan]
change note: 2020-06-22 13:22:07.0 [mmorahan]
change note: 2020-06-22 10:28:25.0 [mmorahan]
in scheme: instruments
definition: OCO-2 will not be measuring CO2 directly; but actually, the intensity of the sunlight reflected from the presence of CO2 in a column of air. This measurement is unique like a fingerprint, and can be used for identification. The OCO-2 instrument will use a diffraction grating (like the back of a compact disk) to separate the incoming sunlight into a spectrum of multiple component colors. The instrument measures the intensity of three relatively small wavelength bands (Weak CO2, Strong CO2 and Oxygen O2) from the spectrum, each specific to one of the three spectrometers. The absorption levels will indicate the presence of the different gases. By simultaneously measuring the gases over the same location and over time, OCO-2 will be able to track the changes over the surface over time. The OCO-2 spectrometers will measure sunlight reflected off the Earth's surface. The sunlight rays entering the spectrometers will pass through the atmosphere twice - once as they travel from the Sun to the Earth, and then again as they bounce off from the Earth's surface to the OCO-2 instrument. Carbon dioxide and molecular oxygen molecules in the atmosphere absorb light energy at very specific colors or wavelengths. The OCO-2 instrument uses diffraction grating to separate the inbound light energy into a spectrum of multiple component colors. The reflection gratings used in the OCO-2 spectrometers will consist of a very regularly-spaced series of grooves that lie on a very flat surface. The characteristic spectral pattern for CO2 can alternate from transparent to opaque over very small variations in wavelength. The OCO-2 instrument must be able to detect these dramatic changes, and specify the wavelengths where these variations take place. So, the grooves in the instrument diffraction grating will be very finely tuned to spread the light spectrum into a large number of very narrow wavelength bands or colors. In fact, the OCO-2 instrument design incorporates 17,500 different colors, to c…

Spectrometers
type: Concept