OCEAN CURRENTS
type: Concept

SURFACE CURRENTS
type: Concept
change note: 2021-10-19 13:54:04.0 [tstevens] insert Definition (id: null text: Ocean surface current direction (vector). language code: en);
change note: 2021-10-19 13:53:12.0 [tstevens] Insert Concept add broader relation (SURFACE CURRENTS [b3647731-a71a-4af4-bfa2-e53b61efafeb,778207] - OCEAN CURRENTS [510c5f78-e19e-4ce4-b59a-8937aeb84631,776111]);
in scheme: sciencekeywords
definition: Ocean surface current direction (vector).