FSSCat
type: Concept
change note: 2021-04-29 09:00:42.0 [mmorahan] insert AltLabel (id: null category: null text: Federated Satellite Systems mission language code: en); insert Definition (id: null text: FSSCat stands for Federated Satellite Systems, consisting of two federated 6-Unit Cubesats. See https://www.esa.int/Applications/Observing_the_Earth/Ph-sat/FSSCat_F-sat-1_ready_for_launch https://directory.eoportal.org/web/eoportal/satellite-missions/p/phisat-1 language code: en);
change note: 2021-04-29 08:51:45.0 [mmorahan] Insert Concept add broader relation (FSSCat [b369f647-96ad-4418-84d2-ee5fed065863,578426] - Earth Observation Satellites [3466eed1-2fbb-49bf-ab0b-dc08731d502b,565556]);
alternative label: Federated Satellite Systems mission
in scheme: platforms
definition: FSSCat stands for Federated Satellite Systems, consisting of two federated 6-Unit Cubesats. See https://www.esa.int/Applications/Observing_the_Earth/Ph-sat/FSSCat_F-sat-1_ready_for_launch https://directory.eoportal.org/web/eoportal/satellite-missions/p/phisat-1

Earth Observation Satellites
type: Concept