Chemical Meters/Analyzers
type: Concept

Thermo Model 49C O3 Analyzer
type: Concept
in scheme: instruments
change note: 2022-11-10 08:20:02.0 [tstevens] update Definition (https://www.eol.ucar.edu/instruments/thermo-environmental-instruments-model-49-ozone-analyzer);
change note: 2021-08-10 07:56:16.0 [tstevens] Insert Concept add broader relation (Thermo Model 49C O3 Analyzer [b3ef4e0e-f30f-434a-9247-7825d1a4e41a,706567] - Chemical Meters/Analyzers [3d25724b-832f-4a61-b0b2-4f2ccecdba94,698163]);
change note: 2021-08-10 07:57:58.0 [tstevens] insert AltLabel (id: null category: primary text: Thermo Model 49C Ozone Analyzer language code: en); insert Definition (id: null text: The Model 49C combines the unique, time shared dual cell design with an enhanced electronics package and user interface. The outcome is a powerful, easy-to-use, UV photometric based ozone analyzer which offers increased specificity via its balanced optical system. language code: en);
definition: The Model 49C combines the unique, time shared dual cell design with an enhanced electronics package and user interface. The outcome is a powerful, easy-to-use, UV photometric based ozone analyzer which offers increased specificity via its balanced optical system.