ACADEMIC
type: Concept

UC-SC/CBSE
type: Concept
in scheme: providers
definition: The center serves as an umbrella organization at UCSC spanning the Baskin School of Engineering and the Division of Physical & Biological Sciences • Our location in the San Francisco Bay Area and proximity to Silicon Valley allows UCSC researchers to collaborate actively with other world-class institutions (Stanford, UC Berkeley, UC San Francisco) and with leading biotechnology and high tech companies. Summary Provided By: http://www.cbse.ucsc.edu/mission.shtml