OCEAN ACOUSTICS
type: Concept

ACOUSTIC SCATTERING
type: Concept
in scheme: sciencekeywords
definition: The process by which some sound is dispersed to travel in directions other than that which from it was incident by particles suspended in the medium through which it is travelling.