PALACE FLOAT
type: Concept
change note: 2022-02-20 14:29:52.0 [tstevens] update Definition (PALACE FLOATS measure profiles of ocean salinity and temperature. Measurements are made as the floats ascend to a drifting horizon. They do this by changing their buoyancy internally. Periodically, the floats rise to the surface, where the data is transmitted via satellite.); delete Resource (null);
change note: 2021-11-18 08:54:09.0 [tstevens] Move Concepts delete broader relation (null); add broader relation (PALACE FLOAT [b4d40e77-a862-418e-a8dc-f7b7e704b4cc,826663] - Unmoored [a5418190-0d3e-4dfb-a9d1-7e5bd0453d61,835896]);
in scheme: platforms
definition: PALACE FLOATS measure profiles of ocean salinity and temperature. Measurements are made as the floats ascend to a drifting horizon. They do this by changing their buoyancy internally. Periodically, the floats rise to the surface, where the data is transmitted via satellite.

Unmoored
type: Concept