CANADA
type: Concept

CA/NRCAN/ESS/GC/MSB
type: Concept
in scheme: providers
definition: Mapping Services Branch produces and maintains topographic information (maps and data) of Canada at reconnaissance and resource scales and develops related technology. Produces aeronautical charts and flight information and maintains a national database of geographic names. Summary Provided By: http://geodiscover.cgdi.ca/gdp/search?action=entrySummary&entryId=2666&entryLang=en&entryType=organization