VITO
type: Concept
change note: 2014-07-25 12:05:25.0 [mpmorahan] insert AltLabel (id: null text: Flemish Institute for Technological Research language code: en);
change note: 2014-07-25 12:04:20.0 [mpmorahan] Insert Concept add broader relation (VITO [b60cff41-3717-4919-8efd-33ee6c173d19,106521] - COMMERCIAL [1bb6821d-8534-40ce-a6ee-7c88ce4d3c9f,66463]);
in scheme: providers
definition: Vito, the Flemish Institute for Technological Research, is an independent centre conducting customer-oriented contract research and developing innovative products and processes in the fields of energy, environment and materials. Vito's activities are focused on stimulating sustainable technological development and high standard R&D in the following fields of expertise: Energy technology Environmental measurement Environmental and process technology Environmental toxicology Integral environmental studies Materials technology Remote sensing and earth observation processes In its Remote sensing and atmospheric processes research domain Vito makes long-lasting and internationally recognised contributions towards the modelling of terrestrial and atmospheric processes and the use of terrestrial observation for monitoring of the environment.

COMMERCIAL
type: Concept