SOIL BIOGEOCHEMISTRY
type: Concept
change note: 2020-05-15 09:27:44.0 [tstevens] Insert Concept add broader relation (SOIL BIOGEOCHEMISTRY [b69052b9-69ab-4294-aa04-5ad639d1b31d,560129] - SOILS [199e3af8-4cf3-48ba-8b28-b9b54756b3db,83673]);
in scheme: sciencekeywords
definition: Biological, geological, chemical and physical processes and reactions that occur within soils

SOILS
type: Concept