CU-LONDON/SOI/DIS
type: Concept
in scheme: providers
definition: The Department of Information Science at London City University is at the forefront of Information Science education and research. The department's interests encompass the theory and practice of information management, processing and retrieval, information-related legal and policy issues, and geographic information handling. Website: http://www.soi.city.ac.uk/organisation/is/

ACADEMIC
type: Concept