JAPAN
type: Concept

JP/JAXA/SAOC
type: Concept
change note: 2015-07-10 17:23:16.0 [mpmorahan] Rename Concept update PrefLabel (JP/JAXA/SAOC);
change note: 2015-07-10 17:24:47.0 [mpmorahan] mmorahan: Update Data Center from MOSS to SAOC update AltLabel (Satellite Applications and Operations Center, Japan Aerospace Exploration Agency, Japan);
change note: 2015-07-10 17:25:58.0 [mpmorahan] mmorahan: Update Data Center from MOSS to SAOC update Definition (Satellite Applications and Operations Center, Japan Aerospace Exploration Agency, Japan);
change note: 2012-08-22 08:27:01.0 [mpmorahan] Insert Concept add broader relation (JP/JAXA/MOSS [b6bb79aa-0743-4730-ba5f-39b6fb28167b,40539] - JAPAN [f5d1252b-e0cd-4c19-9c43-69c7ea65e14d,24365]);
change note: 2012-08-24 20:09:28.0 [mpmorahan] insert AltLabel (id: null text: Mission Operations System Office, Japan Aerospace Exploration Agency, Japan language code: en);
in scheme: providers
definition: Satellite Applications and Operations Center, Japan Aerospace Exploration Agency, Japan