CERES-FM6
type: Concept
change note: 2018-04-11 17:22:18.0 [sritz] insert AltLabel (id: null category: primary text: Clouds and the Earth's Radiant Energy System - Flight Model 6 language code: en);
change note: 2018-04-11 17:27:12.0 [sritz] insert WeightedRelation (id: null related concept uuid: 586db0b3-5f94-466e-b7c1-a2dbedc0c1fc relationship type: null relationship value: null generated by: null);
change note: 2018-04-11 17:21:39.0 [sritz] Insert Concept add broader relation (CERES-FM6 [b6bcacb0-f88c-440e-9401-61dfb8aa2e0d,367487] - Radiometers [5b753e40-b3f1-426a-8d92-ffee1d675468,347283]);
change note: 2018-04-11 17:23:50.0 [sritz] insert Definition (id: null text: CERES FM6, or Clouds and Earth's Radiant Energy System Flight Model 6, is a three-channel radiometer that measures both solar-reflected and Earth-emitted radiation from the top of the atmosphere to the Earth's surface. CERES measures radiances in three broadband channels: a shortwave channel, a total channel, and an infrared window channel. More Information: https://ceres.larc.nasa.gov/jpss1_ceres.php language code: en); insert Resource (id: null type: provider url: https://ceres.larc.nasa.gov/jpss1_ceres.php);
change note: 2018-04-11 17:27:39.0 [sritz] update WeightedRelation (Platform-Instrument); update WeightedRelation (1);
in scheme: instruments
definition: CERES FM6, or Clouds and Earth's Radiant Energy System Flight Model 6, is a three-channel radiometer that measures both solar-reflected and Earth-emitted radiation from the top of the atmosphere to the Earth's surface. CERES measures radiances in three broadband channels: a shortwave channel, a total channel, and an infrared window channel. More Information: https://ceres.larc.nasa.gov/jpss1_ceres.php

Radiometers
type: Concept