SUB-DEBRIS MELT ENHANCEMENT
type: Concept
change note: 2020-12-22 16:02:01.0 [sritz] Insert Concept add broader relation (SUB-DEBRIS MELT ENHANCEMENT [b6c9cc25-b989-4915-a5c6-43dff744b056,560806] - GLACIERS [68eed887-8008-4352-b420-949457ab59ab,84413]);
in scheme: sciencekeywords
definition: Glacier melt rates are influenced by the presence of supraglacial debris. Supraglacial debris can either enhance or reduce ablation relative to bare ice.

GLACIERS
type: Concept