MICROBURSTS
type: Concept
change note: 2017-04-21 11:43:02.0 [tstevens] insert Definition (id: null text: A downburst that covers an area less than 4 km along a side with peak winds that last 2–5 minutes. language code: en);
change note: 2017-04-20 15:11:19.0 [sritz] Insert Concept add broader relation (MICROBURSTS [b73a2e6a-7a8b-443e-98f4-5a77f3a9691c,278897] - LOCAL WINDS [1488b98d-6497-48b9-88db-6ee82a2e3ed3,278859]);
in scheme: sciencekeywords
definition: A downburst that covers an area less than 4 km along a side with peak winds that last 2–5 minutes.

LOCAL WINDS
type: Concept