MASTER
type: Concept
change note: 2021-06-08 14:12:25.0 [sritz] insert Definition (id: null text: The MASTER is similar to the MAS, with the thermal bands modified to more closely match the NASA EOS ASTER (Advanced Spaceborne Thermal Emission and Reflection Radiometer) satellite instrument, which was launched in 1998. It is intended primarily to study geologic and other Earth surface properties. Flying on both high and low altitude aircraft, the MASTER has been operational since early 1998. language code: en);
change note: 2021-06-08 14:07:37.0 [sritz] insert AltLabel (id: null category: primary text: MODIS/ASTER Airborne Simulator language code: en);
change note: 2021-06-08 14:18:37.0 [sritz] insert WeightedRelation (id: null related concept uuid: aacf1f4c-2d79-4946-bc18-6157262d7039 relationship type: null relationship value: null generated by: null);
change note: 2021-06-08 14:16:40.0 [sritz] insert WeightedRelation (id: null related concept uuid: d6aa2406-0323-43c1-b890-3509ee22784e relationship type: null relationship value: null generated by: null);
change note: 2021-06-08 14:26:42.0 [sritz] insert WeightedRelation (id: null related concept uuid: 701c4a38-b7f2-41de-ab5f-d1c8ad76a717 relationship type: null relationship value: null generated by: null);
change note: 2021-06-08 14:14:36.0 [sritz] insert WeightedRelation (id: null related concept uuid: fe2b617a-4571-4442-9a64-51ef8deb0306 relationship type: null relationship value: null generated by: null);
change note: 2021-06-08 14:27:26.0 [sritz] insert WeightedRelation (id: null related concept uuid: 29564e60-e0d6-4d5d-9999-97b9cd16a034 relationship type: null relationship value: null generated by: null);
change note: 2021-06-08 14:07:09.0 [sritz] Insert Concept add broader relation (MASTER [b7ebcb16-ac5e-4def-862b-f68e16c5430a,635347] - Imaging Spectrometers/Radiometers [944b7691-af37-4fb4-9393-c114e7997829,627584]);
definition: The MASTER is similar to the MAS, with the thermal bands modified to more closely match the NASA EOS ASTER (Advanced Spaceborne Thermal Emission and Reflection Radiometer) satellite instrument, which was launched in 1998. It is intended primarily to study geologic and other Earth surface properties. Flying on both high and low altitude aircraft, the MASTER has been operational since early 1998.
in scheme: instruments

Imaging Spectrometers/Radiometers
type: Concept