DOC/NOAA/OAR/ESRL/GMD
type: Concept
change note: 2018-01-26 08:22:52.0 [tstevens] update Definition (NOAA/ESRL's Global Monitoring Division (formerly CMDL) of the National Oceanic and Atmospheric Administration, conducts sustained observations and research related to source and sink strengths, trends and global distributions of atmospheric constituents that are capable of forcing change in the climate of Earth through modification of the atmospheric radiative environment, those that may cause depletion of the global ozone layer, and those that affect baseline air quality.); update Resource (provider); update Resource (https://www.esrl.noaa.gov/gmd/);
change note: 2017-03-10 15:32:00.0 [tstevens] update PrefLabel (DOC/NOAA/OAR/ESRL/GMD);
in scheme: providers
definition: NOAA/ESRL's Global Monitoring Division (formerly CMDL) of the National Oceanic and Atmospheric Administration, conducts sustained observations and research related to source and sink strengths, trends and global distributions of atmospheric constituents that are capable of forcing change in the climate of Earth through modification of the atmospheric radiative environment, those that may cause depletion of the global ozone layer, and those that affect baseline air quality.

NOAA
type: Concept