DOI/USGS/ENERGY
type: Concept
change note: 2013-06-03 09:44:12.0 [tbs1979] update PrefLabel (DOI/USGS/ENERGY); insert AltLabel (id: null text: Energy Team, U.S. Geological Survey, U.S. Department of the Interior language code: en);
change note: 2013-06-03 09:43:42.0 [tbs1979] Insert Concept add broader relation (DOI/USGS/ENERGY/ [b835c2d8-ba6f-4c9a-801f-aed9d53c808e,105189] - USGS [5fea4160-25a7-44b5-bfba-ef140fdffaf4,66487]);
in scheme: providers
definition: The Energy Resources Program is part of the USGS Energy and Minerals, and Environmental Health Mission Area that conducts research and assessments on the location, quantity, and quality of mineral and energy resources, including the economic and environmental effects of resource extraction and use; and conducts research on the environmental impacts of human activities that introduce chemical and pathogenic contaminants into the environment and threaten human, animal (fish and wildlife), and ecological health. The USGS Energy Resources Program addresses the challenge of increasing demand for energy sources by conducting basic and applied research on geologic energy resources and on the environmental, economic, and human health impacts of their production and use. The ERP provides reliable and impartial scientific information on geologically based energy resources, including: oil, natural gas, coal, coalbed methane (CBM), gas hydrates, geothermal resources, uranium, oil shale, and bitumen and heavy oil. The Energy Resources Program is also involved in studying the impacts of wind and solar energy development. The results of USGS research and USGS data are used to inform policymakers regarding domestic and foreign energy resources and to manage energy resources on Federal lands. Major consumers of our products are the land and resource management bureaus of the Department of the Interior, federal environmental and national security agencies, State geological surveys, the energy industry, and the environmental community. [Summary provided by the U.S. Geological Survey.]

USGS
type: Concept