Telescopes
type: Concept

PS0
type: Concept
change note: 2021-07-08 13:03:31.0 [tstevens] change requested by user insert AltLabel (id: null category: primary text: 0th Generation Dove Classic language code: en); insert Definition (id: null text: PS0 features a 2 element Maksutov Cassegrain optical system paired with an 11MP CCD detector. Optical elements are mounted relative to the structure of the spacecraft. language code: en);
change note: 2021-07-08 13:02:46.0 [tstevens] Insert Concept add broader relation (PS0 [b83c7872-9b24-4ffe-97b3-a410d669f88e,663811] - Telescopes [7502f18e-f489-49f5-b879-27d5407df7ec,655838]);
in scheme: instruments
definition: PS0 features a 2 element Maksutov Cassegrain optical system paired with an 11MP CCD detector. Optical elements are mounted relative to the structure of the spacecraft.