UC-BERKELEY/SSL
type: Concept
in scheme: providers
definition: The Space Sciences Laboratory at Berkeley was initiated in 1958 by a committee of the faculty who recognized that the new technology of rockets and satellites opened new realms of investigation and research to the physical, biological, and engineering sciences. Website: "http://www.ssl.berkeley.edu/" [Summary provided by the University of California, Berkeley.]

ACADEMIC
type: Concept