NASA/ARC/ESD/SGE
type: Concept
in scheme: providers
definition: The NASA Ecosystem Science and Technology Branch conducts research in ecosystem modeling, public health, and information technology. They inform the public about NASA research, data and technology developments through education and outreach. In some instances this occurs formally through classroom instruction by branch members and through development of Earth science curriculum materials. Website: "http://geo.arc.nasa.gov/sge/" [Summary provided by NASA.]

NASA
type: Concept