DE/UK/GI
type: Concept
in scheme: providers
definition: These website contains an english description of the main research topics of our institute. You will find the topics on the lefthand navigationpanel. Further information particularly separate webpages of the workinggroups will shown as a link on the bottom navigationpanel. You have to enable JavaScript in order to view these pages. Summary provided by http://www-gpi.physik.uni-karlsruhe.de/

GERMANY
type: Concept