Permanent Land Sites
type: Concept

ASOS
type: Concept
in scheme: platforms
definition: The Automated Surface Observing Systems (ASOS) program is a joint effort of the National Weather Service (NWS), the Federal Aviation Administration (FAA), and the Department of Defense (DOD). The ASOS systems serves as the nation's primary surface weather observing network. ASOS is designed to support weather forecast activities and aviation operations and, at the same time, support the needs of the meteorological, hydrological, and climatological research communities.
change note: 2021-11-17 13:52:40.0 [tstevens] Move Concepts delete broader relation (null); add broader relation (ASOS [b8d95bb8-6841-4a77-8ae7-53375a98bf8f,826680] - Permanent Land Sites [0ec10fd9-492c-498a-b6d8-e2840cc3643b,835887]);
change note: 2022-02-08 09:30:51.0 [tstevens] update Definition (The Automated Surface Observing Systems (ASOS) program is a joint effort of the National Weather Service (NWS), the Federal Aviation Administration (FAA), and the Department of Defense (DOD). The ASOS systems serves as the nation's primary surface weather observing network. ASOS is designed to support weather forecast activities and aviation operations and, at the same time, support the needs of the meteorological, hydrological, and climatological research communities.); update Definition (NOAA); update Resource (image);