A - C
type: Concept

AJAX
type: Concept
change note: 2020-09-22 18:04:27.0 [sritz] insert AltLabel (id: null category: primary text: Alpha Jet Atmospheric eXperiment language code: en); insert Definition (id: null text: The NASA Ames Research Center operates a new research platform for atmospheric studies: an instrumented Alpha Jet. The present complement of instruments allows for the determination of carbon dioxide, ozone, water vapor, and methane concentrations as well as measurements of three-dimensional wind speeds, temperature, and pressure. Planned future instrumentation includes an Air-Core sampler and an instrument to measure formaldehyde. We give examples of measurements that have been made, including measurements carried out during a downward spiral over an expected methane source. An attractive property of this airborne system is its ability to respond rapidly to unexpected atmospheric events such as large forest fires or severe air quality events. language code: en);
change note: 2020-09-22 18:02:44.0 [sritz] Insert Concept add broader relation (AJAX [b960097c-f050-4d34-af06-517dc49b6e4e,560710] - A - C [0c89f3f4-7ab1-43ce-89ee-795d35f0e30a,546613]);
in scheme: projects
definition: The NASA Ames Research Center operates a new research platform for atmospheric studies: an instrumented Alpha Jet. The present complement of instruments allows for the determination of carbon dioxide, ozone, water vapor, and methane concentrations as well as measurements of three-dimensional wind speeds, temperature, and pressure. Planned future instrumentation includes an Air-Core sampler and an instrument to measure formaldehyde. We give examples of measurements that have been made, including measurements carried out during a downward spiral over an expected methane source. An attractive property of this airborne system is its ability to respond rapidly to unexpected atmospheric events such as large forest fires or severe air quality events.