MAPDWELL
type: Concept
change note: 2014-04-10 11:09:48.0 [128.183.164.42] insert AltLabel (id: null text: MAPDWELL language code: en);
change note: 2014-04-10 11:09:05.0 [128.183.164.42] Insert Concept add broader relation (MAPDWELL [b965e6ad-18d0-4826-87f7-15e50018b1ac,106299] - COMMERCIAL [1bb6821d-8534-40ce-a6ee-7c88ce4d3c9f,66463]);
in scheme: providers
definition: The Mapdwell Project is about enabling communities with information that will drive sustainable practices, community awareness, energy efficiency, and smart development through the aggregate effort of individuals. By transforming accurate, open, and unbiased information into education and action, the project proposes an organic –yet highly auspicious– approach to the fossil fuel dilemma. The Mapdwell team works at the intersection of data, design, and technology to craft innovative and intuitive analysis, assessment, and visualization tools –both at the building and context levels– for urban and non-urban regions and systems. Mapdwell –a collective of academics and researchers from the Massachusetts Institute of Technology (M.I.T.) and top professionals– actively engages communities, municipalities, and government agencies to help them disseminate knowledge and obtain sustainability.

COMMERCIAL
type: Concept