Photon/Optical Detectors
type: Concept

AirHARP
type: Concept
change note: 2020-03-24 16:34:43.0 [sritz] insert AltLabel (id: null category: primary text: Airborne Hyper-Angular Rainbow Polarimeter language code: en);
change note: 2020-03-24 16:35:16.0 [sritz] insert Definition (id: null text: language code: en);
change note: 2020-03-24 16:33:59.0 [sritz] Insert Concept add broader relation (AirHARP [b989ab29-6f44-4ae0-ae82-6f10a34682f7,559881] - Photon/Optical Detectors [8143e95e-a438-4a2a-82b2-6d7ae079fba7,544745]);
change note: 2020-03-25 20:07:14.0 [sritz] update Definition (The Airborne Hyper-Angular Rainbow Polarimeter (AirHARP) instrument, designed and developed by the Laboratory for Aerosol and Cloud Optics (LACO) at the University of Maryland, Baltimore County (UMBC), participated in the Aerosol Characterization from Polarimeter and LIDAR (ACEPOL) field campaign over the Western United States and the Pacific Ocean from 19 October to 9 November 2017. AirHARP joined three other polarimeters and two LiDAR instruments on-board the National Aeronautics and Space Administration (NASA) Armstrong Flight Research Center (AFRC) ER-2 high-altitude research aircraft. This document details the Level 1B processing and data quality of AirHARP datasets during this campaign.); update Definition (Excerpt from: J. Vanderlei Martins (PI), Brent A. McBride, Henrique M. J. Barbosa, Xiaoguang Xu, Anin Puthukkudy, Noah Sienkiewicz, Roberto Fernandez-Borda, Lorraine Remer Earth and Space Institute, University of Maryland Baltimore County, Baltimore, MD 21250 https://www-air.larc.nasa.gov/cgi-bin/enzFile?d27141B08DF7F1ACFBAD5C83F9313E20C792f7075622d6169722f5846532f414345504f4c2f323031372f4552325f41495243524146542f4d415254494e532e56414e4445524c45492f414345504f4c2d414952484152502d4c31425f4552325f446174615175616c69747953746174656d656e742d52322e706466 https://www-air.larc.nasa.gov/missions/acepol/index.html);
change note: 2020-03-25 20:09:18.0 [sritz] insert WeightedRelation (id: null related concept uuid: b16010e6-c7ea-4c98-929e-3f844ca2f2c2 relationship type: null relationship value: null generated by: null);
change note: 2020-03-25 20:10:00.0 [sritz] update WeightedRelation (Platform-Instrument); update WeightedRelation (1);
definition: The Airborne Hyper-Angular Rainbow Polarimeter (AirHARP) instrument, designed and developed by the Laboratory for Aerosol and Cloud Optics (LACO) at the University of Maryland, Baltimore County (UMBC), participated in the Aerosol Characterization from Polarimeter and LIDAR (ACEPOL) field campaign over the Western United States and the Pacific Ocean from 19 October to 9 November 2017. AirHARP joined three other polarimeters and two LiDAR instruments on-board the National Aeronautics and Space Administration (NASA) Armstrong Flight Research Center (AFRC) ER-2 high-altitude research aircraft. This document details the Level 1B processing and data quality of AirHARP datasets during this campaign.
in scheme: instruments