OCEAN WINDS
type: Concept

WIND VELOCITY/SPEED
type: Concept
change note: 2022-08-22 13:01:45.0 [sritz] insert Definition (id: null text: Generally, the wind speeds (velocities) at various levels in the atmosphere above the domain of surface weather observations, as determined by any of the methods of winds-aloft observation. language code: en);
change note: 2022-08-05 14:04:20.0 [sritz] Insert Concept add broader relation (WIND VELOCITY/SPEED [b9a716e9-970e-44e0-9faf-66647f5a59ed,1011367] - OCEAN WINDS [346cade5-801a-4afc-9652-48d02905bc4f,1008307]);
in scheme: sciencekeywords
definition: Generally, the wind speeds (velocities) at various levels in the atmosphere above the domain of surface weather observations, as determined by any of the methods of winds-aloft observation.