SATURATION SPECIFIC HUMIDITY
type: Concept
change note: 2017-04-21 13:25:33.0 [sritz] insert Definition (id: null text: The specific humidity of water vapor corresponding to the saturation mixing ratio. language code: en);
change note: 2017-04-20 14:26:04.0 [sritz] Insert Concept add broader relation (SATURATION SPECIFIC HUMIDITY [ba2491a4-2498-4c9f-9adc-123078eef633,278855] - HUMIDITY [427e5121-a142-41cb-a8e9-a70b7f98eb6a,84651]);
in scheme: sciencekeywords
definition: The specific humidity of water vapor corresponding to the saturation mixing ratio.

HUMIDITY
type: Concept