SEA ICE CONCENTRATION
type: Concept
in scheme: sciencekeywords
definition: The ratio of the area of the water surface covered by ice as a fraction of the whole area. Sea ice concentration has been monitored by polar orbiting satellites at all wavelengths.

SEA ICE
type: Concept