RIVER
type: Concept
change note: 2013-04-01 09:01:58.0 [tbs1979] insert Definition (id: null text: A long narrow channel of water that flows as a function of gravity and elevation across the Earth's surface. Many rivers empty into lakes, seas, or oceans. language code: en);
change note: 2013-02-18 10:41:25.0 [tbs1979] Insert Concept add broader relation (RIVER [bb6b3b76-c496-464b-bd20-1b22296aae15,82461] - FLUVIAL LANDFORMS [cb5193ab-2d7a-4b35-b7ec-f16ce78ae270,64131]);
in scheme: sciencekeywords
definition: A long narrow channel of water that flows as a function of gravity and elevation across the Earth's surface. Many rivers empty into lakes, seas, or oceans.

FLUVIAL LANDFORMS
type: Concept