NATURAL HAZARDS
type: Concept

BIOLOGICAL HAZARDS
type: Concept
change note: 2012-07-11 10:58:48.0 [tbs1979] update Definition (Living organisms or derivates(e.g., viruses, bacteria, fungi, and mammal and bird antigens) that can cause harmful health effects when inhaled, swallowed, or otherwise taken into the body.); update Definition (United States Environmental Protection Agency (U.S. EPA) Terminology Reference System);
in scheme: sciencekeywords
definition: Living organisms or derivates(e.g., viruses, bacteria, fungi, and mammal and bird antigens) that can cause harmful health effects when inhaled, swallowed, or otherwise taken into the body.