SAGA
type: Concept
definition: As part of the measurement team on the NASA DC-8 we operate two related installations: a mist chamber/ion chromatograph (MC/IC) sampling/analysis system providing near real time results for selected species, and a bulk aerosol system that collects particulates onto filters for subsequent analysis.
in scheme: instruments
change note: 2023-04-13 15:33:23.0 [sritz] insert Definition (id: null text: As part of the measurement team on the NASA DC-8 we operate two related installations: a mist chamber/ion chromatograph (MC/IC) sampling/analysis system providing near real time results for selected species, and a bulk aerosol system that collects particulates onto filters for subsequent analysis. language code: en);
change note: 2023-04-13 15:32:40.0 [sritz] insert AltLabel (id: null category: primary text: Soluble Acidic Gases and Aerosols language code: en);
change note: 2023-04-13 15:29:30.0 [sritz] Insert Concept add broader relation (SAGA [bb84c29a-ec15-4598-a3f6-7644a45a19ff,1276538] - Chemical Meters/Analyzers [3d25724b-832f-4a61-b0b2-4f2ccecdba94,1267692]);

Chemical Meters/Analyzers
type: Concept