NASA/GSFC/EOS/CARSTAD
type: Concept
in scheme: providers
definition: Space Studies Board of the U.S. National Research Council has prepared a detailed history of the Mission to Planet Earth Program and reviewed the overall development and organization of U.S. civil Earth observations programs. Published in 1995, the report provides useful programmatic background for understanding the current and planned suite of Earth remote sensing satellites and associated instruments. Summary Provided By: http://sedac.ciesin.columbia.edu/remote/app1.html

NASA
type: Concept