NON-GOVERNMENT/NON-PROFIT ORGANIZATIONS
type: Concept

SII
type: Concept
in scheme: providers
definition: Sirenian International, Inc., is a organization of grassroots people who share a dedication to manatee & dugong research, education, and conservation through inter-cultural collaboration. We are a partnership of scientists, students, educators, conservationists, and the public. We believe in the process of integrating science, education, and culture to catalyze positive change in our shared environment, Mother Earth. Summary Provided By: http://www.sirenian.org/aboutSI.html