Surface
type: Concept

R/V LL
type: Concept
change note: 2022-02-23 13:41:13.0 [tstevens] update Definition (The R/V Lady Lisa is a 75’ St. Augustine Trawler. Built in 1980, she is powered by a 415 HP, 12 cylinder Caterpillar Engine and is capable of towing two 80’ trawls. The vessel has accommodations for 3 crew members and 8 scientists, including a complete head and shower, as well as dry storage space for gear and cold storage space for samples. The R/V Lady Lisa is the primary sampling platform for several state and federal projects, working mostly in near coastal waters between Cape Hatteras, NC and Cape Canaveral, Florida.); update Resource (image);
change note: 2021-11-18 09:27:39.0 [tstevens] Move Concepts delete broader relation (null); add broader relation (R/V LL [bc5dbb9e-0395-4291-933b-a2281be644ca,826691] - Surface [59b97a6c-385e-40a2-8422-ecbdb6023c4c,835900]);
in scheme: platforms
definition: The R/V Lady Lisa is a 75’ St. Augustine Trawler. Built in 1980, she is powered by a 415 HP, 12 cylinder Caterpillar Engine and is capable of towing two 80’ trawls. The vessel has accommodations for 3 crew members and 8 scientists, including a complete head and shower, as well as dry storage space for gear and cold storage space for samples. The R/V Lady Lisa is the primary sampling platform for several state and federal projects, working mostly in near coastal waters between Cape Hatteras, NC and Cape Canaveral, Florida.