Surface
type: Concept

B/O SG
type: Concept
change note: 2021-11-18 09:32:59.0 [tstevens] Move Concepts delete broader relation (null); add broader relation (B/O SG [bccde7bb-3a29-4919-85ce-0b8f446d707d,826693] - Surface [59b97a6c-385e-40a2-8422-ecbdb6023c4c,835900]);
change note: 2012-10-16 16:04:32.0 [aaleman] Move Concepts add broader relation (B/O SG [bccde7bb-3a29-4919-85ce-0b8f446d707d,31215] - SHIPS [82a67b12-e99d-4c90-8a6a-a6f79d4c3c7b,31201]); delete broader relation (null);
in scheme: platforms
definition: The new Oceanographic Vessel (B / O) Sarmiento de Gamboa, launched on January 30, 2006 in the presence of Her Majesty Queen Sofia, is considered of great scientific facility and incorporates the latest technology both in terms of system navigation (eg dynamic positioning) and its scientific equipment, besides being the first Spanish oceanographic ship that can work with ROV's (Remote Operated Vehicle) to great depths and AUV's (Autonomous Underwater Vehicle). Will be used primarily to do research and science in the Atlantic Ocean, so that its base of operations is a port of Galicia. Group: Platform_Details Entry_ID: B/O SG Group: Platform_Identification Platform_Category: In Situ Ocean-based Platforms Platform_Series_or_Entity: Ships Short_Name: B/O SG Long_Name: B/O SARMIENTO DE GAMBOA End_Group Creation_Date: 2012-07-19 Online_Resource: http://www.utm.csic.es/sarmiento.asp Sample_Image: http://www.utm.csic.es/imagenes/infraestructuras/sarmiento/sarmiento_179x116.jpg End_Group