SHOWALTER STABILITY INDEX (SI)
type: Concept
change note: 2017-07-14 16:00:36.0 [sritz] Insert Concept add broader relation (SHOWALTER STABILITY INDEX (SI) [bd0c62a2-5336-4b41-81e1-089ce118651a,309809] - Stability/Severe Weather Indices [7844ae66-f542-442f-8359-05014bc19831,309797]);
in scheme: sciencekeywords
definition: Showalter Index = in units of degrees Celsius (°C) is a parcel-based index, calculated in the same manner as the LI, using a parcel at 850 hPa.

Stability/Severe Weather Indices
type: Concept