CONSORTIA/INSTITUTIONS
type: Concept

SEI
type: Concept
in scheme: providers
definition: The Stockholm Environment Institute US Center (SEI-US) is a non-profit research organization affiliated with the Stockholm Environment Institute, an international research organization working on sustainable development. We are also a research affiliate of Tufts University in Massachusetts. Our main office is on the Tufts campus in Somerville, MA and we also have offices in Davis, California and Seattle, Washington. Summary Provided By: http://www.seib.org/index.html