NAGOYA-U/RCAEC
type: Concept
in scheme: providers
definition: The center was established in April 1, 2002 for research and education on high temperature energy conversion system (new gas turbine system) of high efficiency and low NOx emission, combustion diagnostics/and fuel cells, fuel reforming, thermoelectric generation, heat pumps, thermoelectric materials, new heat-resistant materials and their analyses in order to effective utilization of waste heat. Summary Provided by: http://www.nagoya-u.ac.jp/english/study/index_2f_20.html

ACADEMIC
type: Concept