ODM
type: Concept
change note: 2019-11-15 12:04:53.0 [sritz] Insert Concept add broader relation (ODM [bd629a09-0521-4220-b2d9-9ba5ba5985db,423349] - Photon/Optical Detectors [8143e95e-a438-4a2a-82b2-6d7ae079fba7,408483]);
change note: 2019-11-15 12:05:54.0 [sritz] insert AltLabel (id: null category: primary text: Optical Disdrometer language code: en);
change note: 2019-11-15 12:10:12.0 [sritz] update Definition (NASA GHRC DAAC, https://ghrc.nsstc.nasa.gov/);
change note: 2019-11-15 12:08:06.0 [sritz] insert Definition (id: null text: An optical disdrometer that uses infrared light to measure falling precipitation. language code: en);
in scheme: instruments
definition: An optical disdrometer that uses infrared light to measure falling precipitation.

Photon/Optical Detectors
type: Concept