CGIAR/CSI
type: Concept
in scheme: providers
definition: The fifteen CGIAR International Research Centers have pioneered the application of Geographic Information Systems (GIS) and Remote Sensing (RS) for sustainable agricultural development for more than a decade. In May 1999, they formed the Consortium for Spatial Information (CGIAR-CSI) which links the all of the CGIARs GIS/RS laboratories, and the many geospatial scientists and researchers within the CGIAR system, with scientists and institutions from around the world. Together, these laboratories, scientists and researchers constitute a formidable assemblage of technical ingenuity, scientific expertise, and practical experience in spatial analysis. Summary Provided By: http://csi.cgiar.org/WhtIsCGIAR_CSI.asp

CONSORTIA/INSTITUTIONS
type: Concept