GLONASS
type: Concept

GLONASS RECEIVERS
type: Concept
change note: 2017-08-15 10:31:14.0 [tstevens] insert Definition (id: null text: A GLONASS Receiver is a L-band radio processor capable of solving the navigation equations in order to determine the user position, velocity and precise time (PVT), by processing the signal broadcasted by GLONASS satellites. language code: en);
change note: 2017-08-14 15:34:37.0 [tstevens] Insert Concept add broader relation (GLONASS RECEIVERS [bd926f5e-a39d-4f8d-9e6c-0b7f353f210e,309943] - GLONASS [7954c30c-becb-4793-83ea-2c53ad0c6706,309935]);
in scheme: instruments
definition: A GLONASS Receiver is a L-band radio processor capable of solving the navigation equations in order to determine the user position, velocity and precise time (PVT), by processing the signal broadcasted by GLONASS satellites.