CCD1 (HuanJing 1B)
type: Concept
change note: 2012-07-25 11:00:38.0 [mpmorahan] Insert Concept add broader relation (CCD1 (HuanJing 1B) [bde63ed6-0984-4705-801c-45c82546da6f,40367] - Cameras [d322ae9d-bde0-448f-948d-777aef096eb6,32929]);
in scheme: instruments
definition: CCD camera for: Multispectral measurements of Earth's surface for natural environment and disaster applications. Resolution Summary: 30 m Swath Summary: 360 km (per set), 720 km (two sets) Waveband Summary: 0.43 - 0.90 µm (4 bands) VIS (~0.40 µm - ~0.75 µm) NIR (~0.75 µm - ~1.3 µm) Group: Instrument_Details Entry_ID: CCD1 (HuanJing 1B) Group: Instrument_Identification Instrument_Category: Earth Remote Sensing Instruments Instrument_Class: Passive Remote Sensing Instrument_Type: Photon/Optical Detectors Instrument_Subtype: Cameras Short_Name: CCD1 (HuanJing 1B) Long_Name: Charge-coupled Device 1 End_Group Group: Associated_Platforms Short_Name: HJ1B End_Group Group: Spectral_Frequency_Information Wavelength_Keyword: Visible Number_Channels: 1-3 Spectral_Frequency_Coverage_Range: ~0.40 µm - ~0.75 µm Spectral_Frequency_Resolution: 30 m End_Group Group: Spectral_Frequency_Information Wavelength_Keyword: Near Infrared Number_Channels: 4 Spectral_Frequency_Coverage_Range: ~0.75 µm - ~1.3 µm Spectral_Frequency_Resolution: 30 m End_Group Online_Resource: http://www.cresda.com/n16/n92006/n92066/n98627/index.html Creation_Date: 2012-07-25 Group: Instrument_Logistics Data_Rate: 120 Mbps Instrument_Start_Date: 2008-09-06 Instrument_Owner: CAST End_Group End_Group

Cameras
type: Concept