SISTER
type: Concept
change note: 2023-05-11 12:39:16.0 [tstevens] update Definition (The Space-based Imaging Spectroscopy and Thermal pathfindER (SISTER) is a NASA project aimed at prototyping workflows and generating Surface Biology and Geology (SBG)-like data products utilizing existing airborne and spaceborne sources in efforts to sustain and build the community to increase prospects for major scientific discovery post launch of the SBG mission.);
change note: 2023-01-20 12:35:12.0 [tstevens] insert AltLabel (id: null category: primary text: Space-based Imaging Spectroscopy and Thermal pathfindER language code: en); insert Definition (id: null text: The Space-based Imaging Spectroscopy and Thermal pathfindER (SISTER) is a 5-year NASA project (2021-2025) and one of the two pathfinder projects that support the NASA Surface Biology and Geology (SBG) mission. The objective of SISTER is to mature many of the workflows using community-provided algorithms envisioned for SBG, lay the groundwork to develop a robust cal/val network, and build a vigorous and expansive user community ahead of launch. It will enable evaluations that significantly increase the prospects for major scientific discovery in SBG's early post-launch period. language code: en);
change note: 2023-01-20 12:34:15.0 [tstevens] Insert Concept add broader relation (SISTER [bdfcc19f-5d86-46fd-ab8d-cf197887523d,1202691] - S - U [4eb1894b-35b4-406b-8864-944a42bc7702,1196029]);
change note: 2023-01-24 11:15:59.0 [tstevens] update Definition (The Space-based Imaging Spectroscopy and Thermal pathfindER (SISTER) is a 5-year NASA project (2021-2025) and a pathfinder project that supports the NASA Surface Biology and Geology (SBG) mission. The objective of SISTER is to mature many of the workflows using community-provided algorithms envisioned for SBG, lay the groundwork to develop a robust cal/val network, and build a vigorous and expansive user community ahead of launch. It will enable evaluations that significantly increase the prospects for major scientific discovery in SBG's early post-launch period.);
in scheme: projects
definition: The Space-based Imaging Spectroscopy and Thermal pathfindER (SISTER) is a NASA project aimed at prototyping workflows and generating Surface Biology and Geology (SBG)-like data products utilizing existing airborne and spaceborne sources in efforts to sustain and build the community to increase prospects for major scientific discovery post launch of the SBG mission.

S - U
type: Concept