JHU/DMS
type: Concept
in scheme: providers
definition: The JHU Data Management Services (JHU DMS), offered by the Sheridan Libraries, has been set up to help alleviate this burden from the researcher, freeing up valuable time and resources so you can focus on your research. JHU DMS offers direct support for data management planning and assists with the generation of Data Management plans. JHU DMS, backed by the Data Conservancy, provides a state-of-the-art digital archive for both short-term and long-term data archiving. For information specific to your grant proposal and NSF directorate, contact your Data Management Consultant.

ACADEMIC
type: Concept