SHMSA-SR
type: Concept
change note: 2015-08-03 11:55:00.0 [mpmorahan] insert AltLabel (id: null text: Medium resolution wide capture multispectral optical sensor language code: en);
change note: 2015-08-03 11:53:35.0 [mpmorahan] Insert Concept add broader relation (SHMSA-SR [beee83ac-12f6-4fe0-a8d6-386ce41be39d,158147] - Imaging Spectrometers/Radiometers [944b7691-af37-4fb4-9393-c114e7997829,144651]);
in scheme: instruments
definition: Medium resolution wide capture multispectral optical sensor(SHMSA-SR) Group: Instrument_Details Entry_ID: SHMSA-SR Group: Instrument_Identification Instrument_Category: Earth Remote Sensing Instruments Instrument_Class: Passive Remote Sensing Instrument_Type: Spectrometers/Radiometers Instrument_Subtype: Imaging Spectrometers/Radiometers Short_Name: SHMSA-SR Long_Name: Medium resolution wide capture multispectral optical sensor End_Group Group: Associated_Platforms Short_Name: Resurs-P N1 Short_Name: Resurs-P N2 End_Group Group: Spectral_Frequency_Information Wavelength_Keyword: Visible Spectral_Frequency_Coverage_Range: 0.43 μm - 0.7 μm End_Group Group: Spectral_Frequency_Information Wavelength_Keyword: Visible Spectral_Frequency_Coverage_Range: 0.43 - 0.51 µm End_Group Group: Spectral_Frequency_Information Wavelength_Keyword: Visible Spectral_Frequency_Coverage_Range: 0.51 - 0.58 µm End_Group Group: Spectral_Frequency_Information Wavelength_Keyword: Visible Spectral_Frequency_Coverage_Range: 0.6 - 0.7 µm End_Group Group: Spectral_Frequency_Information Wavelength_Keyword: Visible Spectral_Frequency_Coverage_Range: 0.7 - 0.8 µm End_Group Group: Spectral_Frequency_Information Wavelength_Keyword: Near Infrared Spectral_Frequency_Coverage_Range: 0.7 - 0.8 µm End_Group Group: Spectral_Frequency_Information Wavelength_Keyword: Near Infrared Spectral_Frequency_Coverage_Range: 0.80 - 0.90 µm End_Group Sample_Image: http://s016.radikal.ru/i335/1506/5a/58cae2622e8e.jpg Creation_Date: 2015-01-26 Group: Instrument_Logistics Instrument_Owner: Russia/ROSCOSMOS End_Group End_Group

Imaging Spectrometers/Radiometers
type: Concept