TERRESTRIAL WATER STORAGE
type: Concept
change note: 2021-05-21 08:46:49.0 [tstevens] update Definition (https://podaac.jpl.nasa.gov/dataset/TELLUS_GRAC_L3_JPL_RL06_LND_v03);
change note: 2021-05-17 08:56:33.0 [tstevens] Insert Concept add broader relation (TERRESTRIAL WATER STORAGE [bf18cf2c-30b7-4c2b-94d1-68cf3869cb15,621134] - WATER BUDGET [f8702aed-a0ae-46f0-89eb-abde858bc6ac,621001]);
in scheme: sciencekeywords
definition: The summation of all water on the land surface and in the subsurface. It includes surface soil moisture, root zone soil moisture, groundwater, snow, ice, water stored in the vegetation, rivers and lakes.

WATER BUDGET
type: Concept