AIRGLOW
type: Concept
in scheme: sciencekeywords
definition: A faint luminescence of the night sky originating in photochemical reactions in the upper atmosphere. Also referred to as geocoronal emission.

ATMOSPHERIC RADIATION
type: Concept