MARINE VOLCANISM
type: Concept

BENTHIC HEAT FLOW
type: Concept
in scheme: sciencekeywords
definition: Pertaining to the heat disapation through the deep oceanic crust from the Earth's mantle, which decreases with distance from the midocean ridge.